{"text_format":"1","workbook":"xlsx","n_sheets":9,"sheets":["Start","Annahmerichtlinien ","Wettbewerb Budget","Return on Invest","Detail Berechnung","Absentismus","Präsentismus","Fluktuation","Branchenzahlen"],"not_rendered":{"charts":0,"images":10,"macros":1,"external_links":1,"defined_names":7,"comments":1,"pivot_tables":0},"unopened":[],"bounds":{"document_bytes":16777216,"sheet_cells":100000,"rows_first":2000,"rows_last":500,"rows_between":2000,"halvings":0,"cell_chars":16384,"cell_head_chars":4096},"cells_cut":0,"cells_raw":0,"read":"whole","date_system":"1900"}

{"sheet":"Start","index":0,"n_rows":10,"n_cols":4,"rows_kept":10,"cut":false,"hidden":false,"merged":[]}
[]
[]
[]
[]
[]
[]
[]
[]
[]
[null,null,null,{"$f":"IF(D9=\"\",\"\",VLOOKUP(D9,'Wettbewerb Budget'!D2:AJ50,Start!F8,FALSE))","v":""}]
{"$rows_left_out":1}
{"sheet":"Annahmerichtlinien ","index":1,"n_rows":17,"n_cols":20,"rows_kept":17,"cut":false,"hidden":true,"merged":[[1,1,1,12],[16,9,16,12],[3,1,3,2],[3,3,3,5],[3,6,3,8],[3,9,3,12],[5,10,5,11],[6,1,7,1],[8,1,10,1],[10,3,10,5],[11,1,12,1],[14,1,16,1],[4,9,4,12]]}
[]
[null,"Quick-Check Annahmerichtlinien "]
[]
[null,"Tarif ",null,"Mitarbeitende AG-Finanzierung  ",null,null,"Familienangehörige ",null,null,"Mitarbeitende AN-Finanzierung"]
[null,null,null,null,null,null,null,null,null,"Hinweis: Mitarbeitende, für die ein AG-finanzierter Tarif abgeschlossen wurde, können ihren Versicherungsschutz nur mit Tarifen aus anderen Leistungsbereichen gegen eigene Beitragszahlung erweitern (zulässiges Beispiel: MediGroupAG Z Premium und MediGroup ZB;  unzulässiges Beispiel: MediGroupAG Z Premium und MediGroup Z Duo). "]
[null,null,null,"MA-Zahl","Bedingung","Anmeldung","Auswahl","Bedingung","Anmeldung","MA-Zahl","Bedingung",null,"Anmeldung"]
[null,"Stationär",null,null,{"$f":"IF(AND(S7=TRUE,D7>=20),\"ohne Gesundheitsprüfung, mit Berufsprüfung, laufende und angeratene Behandlungen mitversichert\",IF(AND(S7=TRUE,D7<20,D7>=10),\"ohne Gesundheitsprüfung, aber bestimmte schwere Vorerkrankungen ausgeschlossen, Berufsprüfung\",\"nicht ausgewählt\"))","v":"nicht ausgewählt"},{"$f":"IF(AND(S7=TRUE,D7>=10),\"Checkliste, dann Anmeldung der MA über Meldeliste von GVU\",\"\")","v":""},null,{"$f":"IF(AND(S7=TRUE,D7<20,D7>=10,T7=TRUE),\"mit Gesundheits- und Berufsprüfung\",IF(AND(S7=TRUE,D7>=20,T7=TRUE),\"ohne Gesundheitsprüfung innerhalb von 6 Monaten im gleichen Tarif, bestimmte schwere Vorerkrankungen ausgeschlossen, Berufsprüfung\",\"\"))","v":""},{"$f":"IF(AND(S7=TRUE,T7=TRUE,D7<20,D7>1),\"MediGroup Antrag\",IF(AND(S7=TRUE,T7=TRUE,D7>=20),\"speziellen Antrag mit sog. Merkblattregelung bei GVU anfordern\",\"\"))","v":""},null,{"$f":"IF(AND(J7>=5,J7<50,S7=TRUE),\"mit Gesundheits- und Berufsprüfung\",IF(AND(J7>=50,S7=TRUE),\"ohne Gesundheitsprüfung, sodass laufende und angeratene Behandlungen mitversichert sind, sofern nicht mehr als 20 AU-Tage in den letzten 12 Monaten, Berufsprüfung\",\"nicht ausgewählt\"))","v":"nicht ausgewählt"},{"$f":"IF(AND(J7>=5,J7<20,S7=TRUE),\"Risikozuschlag, Leistungsausschluss, Ablehnung möglich\",IF(AND(J7>=20,J7<50,S7=TRUE),\"Risikozuschlag, Leistungsausschluss möglich, keine Ablehnung\",IF(AND(S7=TRUE,J7>=50),\"keine Ablehnung\",\"\")))","v":""},{"$f":"IF(AND(S7=TRUE,J7>=5,J7<50),\"MediGroup Antrag\",IF(AND(S7=TRUE,J7>=50),\"Antrag über GVU\",\"\"))","v":""},null,null,null,null,null,false,false]
[null,null,null,null,{"$f":"IF(AND(S8=TRUE,D8>=20),\"ohne Gesundheitsprüfung, mit Berufsprüfung\",IF(AND(S8=TRUE,D8<20,D8>=5),\"ohne Gesundheitsprüfung, laufende und angeratene Behandlungen nicht versichert, Berufsprüfung\",\"nicht ausgewählt\"))","v":"nicht ausgewählt"},{"$f":"IF(AND(S8=TRUE,D8>=5),\"Checkliste, dann Anmeldung der MA über Meldeliste von GVU\",\"\")","v":""},null,{"$f":"IF(AND(S8=TRUE,D8<20,D8>=5,T8=TRUE),\"ohne Gesundheitsprüfung, mit Berufsprüfung\",IF(AND(S8=TRUE,D8>=20,T8=TRUE),\"ohne Gesundheitsprüfung, mit Berufsprüfung\",\"\"))","v":""},{"$f":"IF(AND(S8=TRUE,T8=TRUE,D8<20,D8>1),\"MediGroupAntrag\",IF(AND(S8=TRUE,T8=TRUE,D8>=20),\"speziellen Antrag mit sog. Merkblattregelung bei GVU anfordern\",\"\"))","v":""},null,{"$f":"IF(AND(J8>=5,J8<50,S8=TRUE),\"ohne Gesundheitsprüfung, mit Berufsprüfung\",IF(AND(J8>=50,S8=TRUE),\"ohne Gesundheitsprüfung, mit Berufsprüfung\",\"nicht ausgewählt\"))","v":"nicht ausgewählt"},{"$f":"IF(AND(J8>=5,J8<20,S8=TRUE),\"Ablehnung möglich\",IF(AND(J8>=20,J8<50,S8=TRUE),\"keine Ablehnung\",IF(AND(S8=TRUE,J8>=50),\"keine Ablehnung\",\"\")))","v":""},{"$f":"IF(AND(S8=TRUE,J8>=5,J8<50),\"MediGroup Antrag\",IF(AND(S8=TRUE,J8>=50),\"Antrag über GVU\",\"\"))","v":""},null,null,null,null,null,false,false]
[null,"Zahn",null,null,{"$f":"IF(AND(S9=TRUE,D9>=20),\"ohne Gesundheits- und Berufsprüfung (ausg. Zahnarztpraxen), laufende und angeratene Behandlungen mitversichert\",IF(AND(S9=TRUE,D9<20,D9>=5),\"ohne Gesundheitsprüfung, laufende und angeratene Behandlungen nicht versichert, keine Berufsprüfung (ausg. Zahnarztpraxen)\",\"nicht ausgewählt\"))","v":"nicht ausgewählt"},{"$f":"IF(AND(S9=TRUE,D9>=5),\"Checkliste, dann Anmeldung der MA über Meldeliste von GVU\",\"\")","v":""},null,{"$f":"IF(AND(S9=TRUE,D9<20,D9>=5,T9=TRUE),\"ohne Gesundheitsprüfung, laufende und angeratene Behandlungen sind mitversichert, keine Berufsprüfung (ausg. Zahnarztpraxen)\",IF(AND(S9=TRUE,D9>=20,T9=TRUE),\"ohne Gesundheitsprüfung, laufende und angeratene Behandlungen  mitversichert, keine Berufsprüfung (ausg. Zahnarztpraxen)\",\"\"))","v":""},{"$f":"IF(AND(S9=TRUE,T9=TRUE,D9<20,D9>1),\"MediGroupAntrag\",IF(AND(S9=TRUE,T9=TRUE,D9>=20),\"speziellen Antrag mit Merkblattregelung bei GVU anfordern\",\"\"))","v":""},null,{"$f":"IF(AND(J9>=5,J9<50,S9=TRUE),\"ohne Gesundheitsprüfung, aber fehlende Zähne sowie laufende und angeratene Behandlungen nicht versichert, keine Berufsprüfung (ausg. Zahnarztpraxen)\",IF(AND(J9>=50,S9=TRUE),\"ohne Gesundheitsprüfung, sodass laufende und angeratene Behandlungen mitvrersichert sind, sofern nicht mehr als 20 AU-Tage in den letzten 12 Monaten, keine Berufsprüfung (ausg. Zahnarztpraxen)\",\"nicht ausgewählt\"))","v":"nicht ausgewählt"},"",{"$f":"IF(AND(S9=TRUE,J9>=5,J9<50),\"MediGroup Antrag\",IF(AND(S9=TRUE,J9>=50),\"Antrag über GVU\",\"\"))","v":""},null,null,null,null,null,false,false]
[null,null,null,null,{"$f":"IF(AND(S10=TRUE,D10>=20),\"ohne Gesundheits- und Berufsprüfung (ausg. Zahnarztpraxen), laufende und angeratene Behandlungen mitversichert\",IF(AND(S10=TRUE,D10<20,D10>=5),\"ohne Gesundheitsprüfung, fehlende Zähne sowie laufende und angeratene Behandlungen nicht versichert, keine Berufsprüfung (ausg. Zahnarztpraxen)\",\"nicht ausgewählt\"))","v":"nicht ausgewählt"},{"$f":"IF(AND(S10=TRUE,D10>=5),\"Checkliste, dann Anmeldung der MA über Meldeliste von GVU\",\"\")","v":""},null,{"$f":"IF(AND(S10=TRUE,D10<20,D10>=5,T10=TRUE),\"ohne Gesundheitsprüfung, fehlende Zähne sowie laufende und angeratene Behandlungen nicht versichert, keine Berufsprüfung (ausg. Zahnarztpraxen)\",IF(AND(S10=TRUE,D10>=20,T10=TRUE),\"ohne Gesundheitsprüfung innerhalb von 6 Monaten im gleichen Tarif, fehlende Zänne und laufende/angeratene Behandlungen mitversichert, keine Berufsprüfung (ausg. Zahnarztpraxen)\",\"\"))","v":""},{"$f":"IF(AND(S10=TRUE,T10=TRUE,D10<20,D10>1),\"MediGroupAntrag\",IF(AND(S10=TRUE,T10=TRUE,D10>=20),\"speziellen Antrag mit Merkblattregelung bei GVU anfordern\",\"\"))","v":""},null,{"$f":"IF(AND(J10>=5,J10<50,S10=TRUE),\"ohne Gesundheits- und Berufsprüfung (ausg. Zahnarztpraxen)\",IF(AND(J10>=50,S10=TRUE),\"ohne Gesundheitsprüfung, sodass fehlende Zähne sowie laufende und angeratene Behandlungen mitversichert sind, sofern nicht mehr als 20 AU-Tage in den letzten 12 Monaten, keine Berufsprüfung (ausg. Zahnarztpraxen)\",\"nicht ausgewählt\"))","v":"nicht ausgewählt"},"","",null,null,null,null,null,false,false]
{"$rows_left_out":8}
{"sheet":"Wettbewerb Budget","index":2,"n_rows":52,"n_cols":36,"rows_kept":52,"cut":false,"hidden":false,"merged":[[38,1,42,1],[44,1,48,1],[50,31,50,32],[51,19,51,20],[22,1,32,1],[33,1,34,1],[51,17,51,18]]}
[]
[null,null,"Versicherer","Gothaer","Barmenia","Allianz","ARAG","AXA","AXA","Continentale","Continentale","Continentale","Debeka ","DKV","Generali","Hallesche","Hallesche","Hallesche","Hallesche","HanseMerkur ","HanseMerkur ","LKH","LKH","LKH","Münchner Verein ","Nürnberger ","Ottonova","R+V","SDK","SDK","Signal Iduna","Signal Iduna","Signal Iduna","UKV/VKB","Württembergische","Württembergische"]
[null,null,"Tarif","FlexSelect","WellYou pure","MeineGesundheit","BudgetFlex Komfort BL","FlexMed easy","FlexMed easy Plus","Choose","Choose More ","Choose MAX","Flex","BonusMed Budget","bKV-Budget","FEELfree","FEELfree_plus","    FEELFree:Up ","    FEELfree:up_plus ","BKB","BKBT","TeamUpgrade Smile","TeamUpgrade Fit","TeamUpgrade Complete","GemeinsamGesund Budget","BudgetSelect","CrewCare","Budget PROFIL","ZahnBudget","AmbulantBudget","GesundAKTIV +","GesundAGIL+","GesundVITAL+","BudgetPro","StartBudget300","Budget300 - 1200"]
[null,null,"Versicher + Tarif",{"$f":"D2&\" - \"&CHAR(10)&D3","v":"Gothaer - \nFlexSelect"},{"$f":"E2&\" - \"&CHAR(10)&E3","v":"Barmenia - \nWellYou pure"},{"$f":"F2&\" - \"&CHAR(10)&F3","v":"Allianz - \nMeineGesundheit"},"ARAG - \nBudgetFlex Komfort BL","AXA - \nFlexMed easy","AXA - \nFlexMed easy Plus","Continentale - \nChoose","Continentale - \nChoose More ","Continentale - \nChoose MAX",{"$f":"M2&\" - \"&CHAR(10)&M3","v":"Debeka  - \nFlex"},{"$f":"N2&\" - \"&CHAR(10)&N3","v":"DKV - \nBonusMed Budget"},"Generali - \nbKV-Budget","Hallesche - \nFEELfree","Hallesche - \nFEELfree_plus","Hallesche - \n    FEELFree:Up ","Hallesche - \n    FEELfree:up_plus ","HanseMerkur  - \nBKB","HanseMerkur  - \nBKBT","LKH - \nTeamUpgrade Smile","LKH - \nTeamUpgrade Fit",{"$f":"X2&\" - \"&CHAR(10)&X3","v":"LKH - \nTeamUpgrade Complete"},"Münchner Verein  - \nGemeinsamGesund Budget","Nürnberger  - \nBudgetSelect","Ottonova - \nCrewCare","R+V - \nBudget PROFIL","SDK - \nZahnBudget","SDK - \nAmbulantBudget","Signal Iduna - \nGesundAKTIV +","Signal Iduna - \nGesundAGIL+","Signal Iduna - \nGesundVITAL+","UKV/VKB - \nBudgetPro","Württembergische - \nStartBudget300","Württembergische - \nBudget300 - 1200"]
[null,null,"Tarifeinführung","2020-10-01","2025-01-01","2025-04-01","2022-10-01","2021-07-19",null,"2020-11-01",null,null,"2023-12-01",null,null,"2018-10-01",null,"  01.07.2022","  01.07.2022",null,null,null,null,"2025-04-01","2022-09-01","2022-08-01","2022-09-01","2022-07-01","2021-05-01","2021-05-02","2022-10-01","2022-10-02","2022-10-03","2022-09-01"]
[null,null,"Budget in Euro","300-500-750","300 - 600 - 900","300-600-900-1200-1500","300-600-900-1200-1500","300-600-900-1200-1500","300-600-900-1200-1500","400-800-1200   ","400-800-1200-1600","400-800-1200-1600","300-600-900-1200-1500","300-600-900-1200","300-600-900-1200-1500","300-600-900-1200-1500","300-600-900-1200-1500","300-600-900-1200-1500","300-600-900-1200-1500","300-600-900-1200-1500-1700","300-600-900-1200-1500-1700","300-600-900-1200-1500","300-600-900-1200-1500","300-600-900-1200-1500","300 | 600 |  1000 | 1500 ","300-600-900-1200","300-600-900-1200-1500","300-600-900-1200-1500","500-1000-1500","500-1000-1500","300-600-900-1200-1500","300-600-900-1200-1500","300-600-900-1200-1500","400-800-1200 ",300,"300-600-900-1200"]
[null,null,300,10.4,13.4,13.9,10.91,11.92,12.98,null,null,null,10.9,15.68,12.79,12.99,12.99,14.5,18.61,9.9,10.9,13.5,12.5,12.5,12.9,11.9,13.21,18.93,null,null,13,24.22,32.68,null,5.85,12.31]
[null,null,400,null,null,null,null,null,null,14.49,31.5,32.659999999999997,null,null,null,null,null,null,null,null,null,null,null,null,null,null,null,null,null,null,null,null,null,17.510000000000002]
[null,null,500,15.65,null,null,null,null,null,null,null,null,null,null,null,null,null,null,null,null,null,null,null,null,null,null,null,null,10.88,19.559999999999999]
[null,null,600,null,21.7,22.9,19.48,21.88,19.329999999999998,17.75,38.01,44,19.899999999999999,25.97,24.48,22.88,22.88,25.67,29.64,17.899999999999999,19.899999999999999,21.9,18.899999999999999,18.899999999999999,21.9,19.7,22.54,32.950000000000003,null,null,22,33.22,41.68,null,null,19.82]
{"$rows_left_out":43}
{"sheet":"Return on Invest","index":3,"n_rows":48,"n_cols":7,"rows_kept":48,"cut":false,"hidden":false,"merged":[[1,1,1,6]]}
[]
[null,"Wirtschaftliche Gesamtbetrachtung des bKV Gesundheitsplans"]
[null,"Aus prozessualen Gründen sollten keine Kombinationen aus Barmenia und Gothaer gewählt werden.  "]
[null,"Branche ",null,"Gesundheitswesen"]
[null,null,null,"Gruppe 1","Gruppe 2","Gruppe 3","Gesamt"]
[null,"Anzahl Mitarbeitende",null,500,null,null,{"$f":"'Detail Berechnung'!G7","v":500}]
[null,"Durchschnittliches Jahresbruttoeinkommen je Mitarbeitenden",null,{"$f":"IF(D4=\"\",\"\",VLOOKUP(D4,Branchenzahlen!B3:F13,3,FALSE))","v":55908},{"$f":"IF(E6=\"\",\"\",D7)","v":""},{"$f":"IF(E6=\"\",\"\",D7)","v":""}]
[]
[null,"Tarifwauswahl"]
[null,"Budgettarif ",null,"Gothaer - \nFlexSelect"]
{"$rows_left_out":39}
{"sheet":"Detail Berechnung","index":4,"n_rows":68,"n_cols":7,"rows_kept":68,"cut":false,"hidden":false,"merged":[[3,3,3,6],[2,1,2,6]]}
[]
[]
[null,"Betriebswirtschaftliche Betrachtung eines Gesundheitsplans"]
[]
[null,"Branche ",null,{"$f":"'Return on Invest'!D4","v":"Gesundheitswesen"}]
[null,null,null,"Gruppe 1","Gruppe 2","Gruppe 3","Gesamt"]
[null,"Anzahl Mitarbeitende ",null,{"$f":"'Return on Invest'!D6","v":500},null,null,{"$f":"D7+E7+F7","v":500}]
[null,"Durchschnittliches Jahresbruttoeinkommen je Mitarbeitenden",null,{"$f":"'Return on Invest'!D7","v":55908},{"$f":"'Return on Invest'!E7","v":""},{"$f":"'Return on Invest'!F7","v":""}]
[null,"Bei Budgettarifen: Auswahl von Gesellschaft und Tarif",null,{"$f":"'Return on Invest'!D10","v":"Gothaer - \nFlexSelect"},{"$f":"'Return on Invest'!E10","v":0},{"$f":"'Return on Invest'!F10","v":0}]
[null,"Budgetstufen",null,{"$f":"'Return on Invest'!D11","v":"300-500-750"},{"$f":"'Return on Invest'!E11","v":""},{"$f":"'Return on Invest'!F11","v":""}]
{"$rows_left_out":59}
{"sheet":"Absentismus","index":5,"n_rows":15,"n_cols":4,"rows_kept":15,"cut":false,"hidden":false,"merged":[[2,1,2,3],[4,2,4,3],[5,2,5,3],[8,2,8,3],[9,2,9,3],[6,2,6,3]]}
[]
[]
[null,"Absentismus"]
[]
[null,null,"Absentismus ist das krankheitsbedinge Fernbleiben von der Arbeit. Gemessen werden Absentismuskosten durch die Zählung von Arbeitsunfähigkeitstagen, dem Produktionsaufall (Lohnkosten) sowie dem Bruttowertschöpfungsausfall (Arbeitsproduktivität). "]
[null,"•","Die durchschnittlichen Arbeitsunfähigkeitstage je Branche variieren stark. Den höchsten Ausfall verzeichnet das Cluster \"Öffentliche und sonstige Dienstleister, Erziehung, Gesundheit\"  (s. BAUA, 2024)\n"]
[null,null,{"$f":"IF(C8=\"\",\"\",\"Für die ausgewählte Branche ergeben sich folgende durchschnittliche AU-Tage je Mitarbeitenden:\")","v":"Für die ausgewählte Branche ergeben sich folgende durchschnittliche AU-Tage je Mitarbeitenden:"}]
[null,null,{"$f":"IF('Return on Invest'!D4=\"\",\"\",'Return on Invest'!D4)","v":"Gesundheitswesen"},{"$f":"'Return on Invest'!D29& \"\" &\" Tage\"","v":"26,3 Tage"}]
[null,"•","Die Bundesanstalt für Arbeitsschutz und Arbeitsmedizin hat für das Jahr 2024 den durchschnittlichen Produktionsaufall je Arbeitsunfähigkeitstag in Höhe von 152 € je fehlenden Mitarbeitenden gerechnet. Zusätzlich wird der  Verlust der Arbeitsproduktivität je AU-Tag und Mitarbeitenden durchschnittlich mit 258 € beziffert. Beide Werte addiert (410 €) ergeben die Kosten eines Ausfalltags je Mitarbeitenden. "]
[]
{"$rows_left_out":6}
{"sheet":"Präsentismus","index":6,"n_rows":14,"n_cols":4,"rows_kept":14,"cut":false,"hidden":false,"merged":[[4,2,4,3],[5,2,5,3],[7,2,7,3],[6,2,6,3],[2,1,2,3]]}
[]
[]
[null,"Präsentismus"]
[]
[null,null,"Präsentismus beschreibt das Arbeiten trotz einer Erkrankung - entweder von Zuhause oder vor Ort. Präsentismus kann vom Arbeiten mit leichten Symptomen bis hin zur Tätigkeit trotz schwerwiegender Beschwerden reichen. Dies kann zu einer eingeschränkten Leistungsfähigkeit, Fehlern und Unfällen führen. "]
[null,"•","Präsentsimus ist schwer zu beziffern. Entgegen des Absentismus, wofür Arbeitsunfähigkeitstage zur Messung verwendet werden, gibt es beim Präsentismus kein einheitliches Bewertungsschema. Die Studienlage geht folglich weit auseinander. "]
[null,"•","Laut einer aktuellen Auswertung der Bundesanstalt für Arbeitsschutz und Arbeitsmedizin (BAuA) gaben 54 % der Beschäftigten an, im Jahr 2024 mindestens einmal krank zur Arbeit gegangen zu sein, wobei insbesondere Frauen mit etwa 60 % häufiger Präsentismus zeigten als Männer mit rund 48 %."]
[null,"•","Die Leistung der Mitarbeitenden, die trotz Erkrankung arbeiten, ist durchschnittlich um 20 % gemindert (sog. Produktivitäts-minderung, vgl. Bödeker und Hüsing, 2008)."]
[]
[null,null,"Schlüsselwerte zum Präsentismus","Wirkung der bKV "]
{"$rows_left_out":5}
{"sheet":"Fluktuation","index":7,"n_rows":14,"n_cols":4,"rows_kept":14,"cut":false,"hidden":false,"merged":[[2,1,2,3],[4,2,4,3],[5,2,5,3],[6,2,6,3],[7,2,7,3]]}
[]
[]
[null,"Fluktuation"]
[]
[null,null,"Mitarbeiterfluktuation beschreibt die Abgänge von Angestellten und wird auch als Personalfluktuation bezeichnet. Sie leitet in Unternehmen einen Prozess ein, der von der Kündigungsphase bis zur Rekrutierung und Einstellung neuer Mitarbeitenden andauert. Unter dem Begriff werden sämtliche Auflösungen von Arbeitsverhältnissen zusammengefasst, für gewöhnlich sind damit jedoch arbeitnehmerseitige Kündigungen gemeint."]
[null,"•","Der Verlust von Mitarbeitern ist immer mit Fluktuationskosten verbunden. In welchem Rahmen sich diese bewegen, hängt in erster Linie von der erforderlichen Qualifikation der Mitarbeitenden ab. Die Kosten für Rekrutierung, Einarbeitung und Know-How Verlust stehen im direkten Zusammenhang mit dem Anforderungsprofil. Treten Mitarbeitende aus dem Unternehmen aus, verursacht dies Kosten von ungefähr 120 % des jeweiligen Jahresbruttogehalts:\n\n- 30 % entfallen auf die Minderleistung des Mitarbeitenden nach Entscheidung für den Austritt\n- 30 % Anwerbungskosten (bspw. Kosten für Stellenausschreibungen)\n- 10 % Auswahl und Einstellungskosten (auch Erstattung von Bewerbungskosten)\n- 50 % Einarbeitungskosten im ersten Jahr (vgl. https://www.personio.de/hr-lexikon/fluktuationsrate-berechnen/, Stand 04.2024). "]
[null,"•","Die Fluktuationsrate beschreibt, wie häufig ein Mitarbeitendenwechsel stattfindet. Diese Rate ist branchenabhängig. Das Branchencluster \"Gastgewerbe\" weist die höchste Fluktuationsrate auf. "]
[null,null,{"$f":"IF(C9=\"\",\"\",\"Für die ausgewählte Branche ergeben sich folgende AU-Tage je Mitarbeitenden:\")","v":"Für die ausgewählte Branche ergeben sich folgende AU-Tage je Mitarbeitenden:"}]
[null,null,{"$f":"IF('Return on Invest'!D4=\"\",\"\",'Return on Invest'!D4)","v":"Gesundheitswesen"},{"$f":"IF('Return on Invest'!D4=\"\",\"\",'Return on Invest'!D41)","v":0.219}]
[]
{"$rows_left_out":5}
{"sheet":"Branchenzahlen","index":8,"n_rows":44,"n_cols":6,"rows_kept":44,"cut":false,"hidden":false,"merged":[[13,2,13,3]]}
[]
[]
[null,"Branche","Durchschnittliches Arbeitsentgelt pro Monat","Durchschnittliches Jahrebruttoeinkommen","Krankentage","Flutktuationsrate"]
[null,"Produzierendes Gewerbe (inkl. Baugewerbe)",4596,{"$f":"C4*12","v":55152},24.8,0.184]
[null,"Erziehung und Unterricht",5274,63288,26.3,0.25769999999999998]
[null,"Gastgewerbe",3042,36504,24.8,0.60650000000000004]
[null,"Gesundheitswesen",4659,55908,26.3,0.219]
[null,"Handel, Instandhaltung und Reparatur (inkl. KFZ) ",4252,51024,29.9,0.31540000000000001]
[null,"Immobilien",4531,54372,19.899999999999999,0.255]
[null,"Information und Kommunikation ",5955,71460,14.3,0.48699999999999999]
{"$rows_left_out":34}